Reaction Details
TargetCorticotropin-releasing factor receptor 1
LigandBDBM50395823
Substrate/Competitorn/a
Meas. Tech.ChEMBL_860644 (CHEMBL2167784)
Ki 1.7±n/a nM
Citation Deskus, JADischino, DDMattson, RJDitta, JLParker, MFDenhart, DJZuev, DHuang, HHartz, RAAhuja, VTWong, HMattson, GKMolski, TFGrace, JEZueva, LNielsen, JMDulac, HLi, YWGuaraldi, MAzure, MOnthank, DHayes, MWexler, EMcDonald, JLodge, NJBronson, JJMacor, JE [18F](R)-5-chloro-1-(1-cyclopropyl-2-methoxyethyl)-3-(4-(2-fluoroethoxy)-2,5-dimethyl phenylamino)pyrazin-2(1H)-one: introduction of N3-phenylpyrazinones as potential CRF-R1 PET imaging agents. Bioorg Med Chem Lett22:6651-5 (2012) 
 
Corticotropin-releasing factor receptor 1
Name:Corticotropin-releasing factor receptor 1
Type:Enzyme
Mol. Mass.:50744.31
Organism:Homo sapiens (Human)
Description:P34998
Residue:444
BDBM50395823
NameBDBM50395823
Synonyms:CHEMBL2165205
TypeSmall organic molecule
Emp. Form.C21H26Cl2N4O2
Mol. Mass.437.363
SMILESCOCCN(CCOC)Cc1cc(C)nc2c(c(C)nn12)-c1ccc(Cl)cc1Cl