Reaction Details
Target5-hydroxytryptamine receptor 6
LigandBDBM50395864
Substrate/Competitorn/a
Meas. Tech.ChEMBL_861074 (CHEMBL2166665)
Ki 17.12±n/a nM
Citation Nirogi, RVKonda, JBKambhampati, RShinde, ABandyala, TRGudla, PKandukuri, KKJayarajan, PKandikere, VDubey, PK N,N-Dimethyl-[9-(arylsulfonyl)-2,3,4,9-tetrahydro-1H-carbazol-3-yl]amines as novel, potent and selective 5-HT6 receptor antagonists. Bioorg Med Chem Lett22:6980-5 (2012) 
 
5-hydroxytryptamine receptor 6
Name:5-hydroxytryptamine receptor 6
Type:G Protein-Coupled Receptor (GPCR)
Mol. Mass.:46968.43
Organism:Homo sapiens (Human)
Description:P50406
Residue:440
BDBM50395864
NameBDBM50395864
Synonyms:CHEMBL2165566
TypeSmall organic molecule
Emp. Form.C20H19F3N2O2S
Mol. Mass.408.437
SMILESCNC1CCc2c(C1)c1ccccc1n2S(=O)(=O)c1cccc(c1)C(F)(F)F