Reaction Details
Target5-hydroxytryptamine receptor 6
LigandBDBM50395865
Substrate/Competitorn/a
Meas. Tech.ChEMBL_861074 (CHEMBL2166665)
Ki 29.01±n/a nM
Citation Nirogi, RVKonda, JBKambhampati, RShinde, ABandyala, TRGudla, PKandukuri, KKJayarajan, PKandikere, VDubey, PK N,N-Dimethyl-[9-(arylsulfonyl)-2,3,4,9-tetrahydro-1H-carbazol-3-yl]amines as novel, potent and selective 5-HT6 receptor antagonists. Bioorg Med Chem Lett22:6980-5 (2012) 
 
5-hydroxytryptamine receptor 6
Name:5-hydroxytryptamine receptor 6
Type:G Protein-Coupled Receptor (GPCR)
Mol. Mass.:46968.43
Organism:Homo sapiens (Human)
Description:P50406
Residue:440
BDBM50395865
NameBDBM50395865
Synonyms:CHEMBL2165565
TypeSmall organic molecule
Emp. Form.C20H19BrF2N2O2S
Mol. Mass.469.343
SMILESCN(C)C1CCc2c(C1)c1cc(Br)ccc1n2S(=O)(=O)c1ccc(F)c(F)c1