Reaction Details
Target5-hydroxytryptamine receptor 6
LigandBDBM50395870
Substrate/Competitorn/a
Meas. Tech.ChEMBL_861074 (CHEMBL2166665)
Ki 28.99±n/a nM
Citation Nirogi, RVKonda, JBKambhampati, RShinde, ABandyala, TRGudla, PKandukuri, KKJayarajan, PKandikere, VDubey, PK N,N-Dimethyl-[9-(arylsulfonyl)-2,3,4,9-tetrahydro-1H-carbazol-3-yl]amines as novel, potent and selective 5-HT6 receptor antagonists. Bioorg Med Chem Lett22:6980-5 (2012) 
 
5-hydroxytryptamine receptor 6
Name:5-hydroxytryptamine receptor 6
Type:G Protein-Coupled Receptor (GPCR)
Mol. Mass.:46968.43
Organism:Homo sapiens (Human)
Description:P50406
Residue:440
BDBM50395870
NameBDBM50395870
Synonyms:CHEMBL2165561
TypeSmall organic molecule
Emp. Form.C21H23BrN2O3S
Mol. Mass.463.388
SMILESCOc1ccc(cc1)S(=O)(=O)n1c2CCC(Cc2c2cc(Br)ccc12)N(C)C