Reaction Details
TargetGlycogen synthase kinase-3 beta
LigandBDBM50395887
Substrate/Competitorn/a
Meas. Tech.ChEMBL_858033 (CHEMBL2166769)
Ki 1600±n/a nM
Citation Tell, VHolzer, MHerrmann, LMahmoud, KASchächtele, CTotzke, FHilgeroth, A Multitargeted drug development: Discovery and profiling of dihydroxy substituted 1-aza-9-oxafluorenes as lead compounds targeting Alzheimer disease relevant kinases. Bioorg Med Chem Lett22:6914-8 (2012) 
 
Glycogen synthase kinase-3 beta
Name:Glycogen synthase kinase-3 beta
Type:Enzyme
Mol. Mass.:46756.38
Organism:Homo sapiens (Human)
Description:P49841
Residue:420
BDBM50395887
NameBDBM50395887
Synonyms:CHEMBL2163770
TypeSmall organic molecule
Emp. Form.C28H19NO3
Mol. Mass.417.4554
SMILESOc1cc2c(oc3ncc(OCc4ccccc4)c(-c4ccccc4)c23)c2ccccc12