Reaction Details
TargetGlycogen synthase kinase-3 beta
LigandBDBM50395889
Substrate/Competitorn/a
Meas. Tech.ChEMBL_858033 (CHEMBL2166769)
Ki>1000000±n/a nM
Citation Tell, VHolzer, MHerrmann, LMahmoud, KASchächtele, CTotzke, FHilgeroth, A Multitargeted drug development: Discovery and profiling of dihydroxy substituted 1-aza-9-oxafluorenes as lead compounds targeting Alzheimer disease relevant kinases. Bioorg Med Chem Lett22:6914-8 (2012) 
 
Glycogen synthase kinase-3 beta
Name:Glycogen synthase kinase-3 beta
Type:Enzyme
Mol. Mass.:46756.38
Organism:Homo sapiens (Human)
Description:P49841
Residue:420
BDBM50395889
NameBDBM50395889
Synonyms:CHEMBL2163768
TypeSmall organic molecule
Emp. Form.C18H13NO3
Mol. Mass.291.3007
SMILESCOc1ccc2oc3ncc(O)c(-c4ccccc4)c3c2c1