Reaction Details
TargetUDP-3-O-acyl-N-acetylglucosamine deacetylase
LigandBDBM50395898
Substrate/Competitorn/a
Meas. Tech.ChEMBL_858075 (CHEMBL2166987)
IC50 2.93±n/a nM
Citation McAllister, LAMontgomery, JIAbramite, JAReilly, UBrown, MFChen, JMBarham, RAChe, YChung, SWMenard, CAMitton-Fry, MMullins, LMNoe, MCO'Donnell, JPOliver, RMPenzien, JBPlummer, MPrice, LMShanmugasundaram, VTomaras, APUccello, DP Heterocyclic methylsulfone hydroxamic acid LpxC inhibitors as Gram-negative antibacterial agents. Bioorg Med Chem Lett22:6832-8 (2012) 
 
UDP-3-O-acyl-N-acetylglucosamine deacetylase
Name:UDP-3-O-acyl-N-acetylglucosamine deacetylase
Synonyms:lpxC
Type:PROTEIN
Mol. Mass.:21890.40
Organism:Pseudomonas aeruginosa
Description:ChEMBL_858075
Residue:197
BDBM50395898
NameBDBM50395898
Synonyms:CHEMBL2164191
TypeSmall organic molecule
Emp. Form.C16H20N2O5S
Mol. Mass.352.405
SMILESCc1ccc(cc1)-c1cc(CCC(C)(C(=O)NO)S(C)(=O)=O)on1