Reaction Details
TargetUDP-3-O-acyl-N-acetylglucosamine deacetylase
LigandBDBM50395899
Substrate/Competitorn/a
Meas. Tech.ChEMBL_858075 (CHEMBL2166987)
IC50 8.31±n/a nM
Citation McAllister, LAMontgomery, JIAbramite, JAReilly, UBrown, MFChen, JMBarham, RAChe, YChung, SWMenard, CAMitton-Fry, MMullins, LMNoe, MCO'Donnell, JPOliver, RMPenzien, JBPlummer, MPrice, LMShanmugasundaram, VTomaras, APUccello, DP Heterocyclic methylsulfone hydroxamic acid LpxC inhibitors as Gram-negative antibacterial agents. Bioorg Med Chem Lett22:6832-8 (2012) 
 
UDP-3-O-acyl-N-acetylglucosamine deacetylase
Name:UDP-3-O-acyl-N-acetylglucosamine deacetylase
Synonyms:lpxC
Type:PROTEIN
Mol. Mass.:21890.40
Organism:Pseudomonas aeruginosa
Description:ChEMBL_858075
Residue:197
BDBM50395899
NameBDBM50395899
Synonyms:CHEMBL2164190
TypeSmall organic molecule
Emp. Form.C15H17FN2O5S
Mol. Mass.356.369
SMILESCC(CCc1cc(on1)-c1ccccc1F)(C(=O)NO)S(C)(=O)=O