Reaction Details
TargetMetabotropic glutamate receptor 5
LigandBDBM50395922
Substrate/Competitorn/a
Meas. Tech.ChEMBL_858305 (CHEMBL2168304)
IC50 14.5±n/a nM
Citation Raboisson, PBreitholtz-Emanuelsson, ADahllöf, HEdwards, LHeaton, WLIsaac, MJarvie, KKers, AMinidis, ABNordmark, ASheehan, SMSlassi, AStröm, PTerelius, YWensbo, DWilson, JMXin, TMcLeod, DA Discovery and characterization of AZD9272 and AZD6538-Two novel mGluR5 negative allosteric modulators selected for clinical development. Bioorg Med Chem Lett22:6974-9 (2012) 
 
Metabotropic glutamate receptor 5
Name:Metabotropic glutamate receptor 5
Type:Enzyme
Mol. Mass.:131900.14
Organism:Rattus norvegicus (Rat)
Description:P31424
Residue:1203
BDBM50395922
NameBDBM50395922
Synonyms:CHEMBL2164552
TypeSmall organic molecule
Emp. Form.C15H6FN5O
Mol. Mass.291.2394
SMILESFc1cc(cc(c1)-c1nc(no1)-c1ccc(cn1)C#N)C#N