Reaction Details
TargetMuscarinic acetylcholine receptor M1
LigandBDBM50395979
Substrate/Competitorn/a
Meas. Tech.ChEMBL_858567 (CHEMBL2166012)
IC50 263.03±n/a nM
Citation Poslusney, MSSevel, CUtley, TJBridges, TMMorrison, RDKett, NRSheffler, DJNiswender, CMDaniels, JSConn, PJLindsley, CWWood, MR Synthesis and biological characterization of a series of novel diaryl amide M1 antagonists. Bioorg Med Chem Lett22:6923-8 (2012) 
 
Muscarinic acetylcholine receptor M1
Name:Muscarinic acetylcholine receptor M1
Type:Protein
Mol. Mass.:51442.54
Organism:Homo sapiens (Human)
Description:P11229
Residue:460
BDBM50395979
NameBDBM50395979
Synonyms:CHEMBL2164917
TypeSmall organic molecule
Emp. Form.C22H28N2O
Mol. Mass.336.4705
SMILESCCN1CCN(CC1C)C(=O)C(Cc1ccccc1)c1ccccc1