Reaction Details
TargetCholinesterase
LigandBDBM50396012
Substrate/Competitorn/a
Meas. Tech.ChEMBL_858574 (CHEMBL2166019)
IC50 3130±n/a nM
Citation Brunhofer, GFallarero, AKarlsson, DBatista-Gonzalez, AShinde, PGopi Mohan, CVuorela, P Exploration of natural compounds as sources of new bifunctional scaffolds targeting cholinesterases and beta amyloid aggregation: the case of chelerythrine. Bioorg Med Chem20:6669-79 (2012) 
 
Cholinesterase
Name:Cholinesterase
Type:Homotetramer
Mol. Mass.:68422.27
Organism:Homo sapiens (Human)
Description:P06276
Residue:602
BDBM50396012
NameBDBM50396012
Synonyms:CHEMBL2163791
TypeSmall organic molecule
Emp. Form.C11H12N2O
Mol. Mass.188.2258
SMILESO[C@H]1CCN2Cc3ccccc3N=C12