Reaction Details
TargetLysine-specific histone demethylase 1A
LigandBDBM50346862
Substrate/Competitorn/a
Meas. Tech.ChEMBL_861185 (CHEMBL2173253)
IC50 1900±n/a nM
Citation Decarlo, DHadden, MK Oncoepigenomics: making histone lysine methylation count. Eur J Med Chem56:179-194 (2012) 
 
Lysine-specific histone demethylase 1A
Name:Lysine-specific histone demethylase 1A
Type:Enzyme
Mol. Mass.:92901.01
Organism:Homo sapiens (Human)
Description:O60341
Residue:852
BDBM50346862
NameBDBM50346862
Synonyms:CHEMBL1215658
TypeSmall organic molecule
Emp. Form.C27H29N3O3
Mol. Mass.443.5375
SMILESN[C@@H]1C[C@H]1c1ccc(OCC[C@H](NC(=O)c2ccccc2)C(=O)NCc2ccccc2)cc1