Reaction Details
TargetLysine-specific histone demethylase 1A
LigandBDBM50396014
Substrate/Competitorn/a
Meas. Tech.ChEMBL_861184 (CHEMBL2173252)
Ki 610±n/a nM
Citation Decarlo, DHadden, MK Oncoepigenomics: making histone lysine methylation count. Eur J Med Chem56:179-194 (2012) 
 
Lysine-specific histone demethylase 1A
Name:Lysine-specific histone demethylase 1A
Type:Enzyme
Mol. Mass.:92901.01
Organism:Homo sapiens (Human)
Description:O60341
Residue:852
BDBM50396014
NameBDBM50396014
Synonyms:CHEMBL2169888
TypeSmall organic molecule
Emp. Form.C16H15F2NO
Mol. Mass.275.2932
SMILESN[C@@H]1C[C@H]1c1cc(F)cc(F)c1OCc1ccccc1