Reaction Details
TargetHistone-lysine N-methyltransferase SUV39H1
LigandBDBM50396017
Substrate/Competitorn/a
Meas. Tech.ChEMBL_861216 (CHEMBL2173354)
IC50>100000±n/a nM
Citation Decarlo, DHadden, MK Oncoepigenomics: making histone lysine methylation count. Eur J Med Chem56:179-194 (2012) 
 
Histone-lysine N-methyltransferase SUV39H1
Name:Histone-lysine N-methyltransferase SUV39H1
Type:PROTEIN
Mol. Mass.:47917.07
Organism:Homo sapiens (Human)
Description:ChEMBL_1473655
Residue:412
BDBM50396017
NameBDBM50396017
Synonyms:CHEMBL2172427
TypeSmall organic molecule
Emp. Form.C18H28IN7O5
Mol. Mass.549.3633
SMILESCNc1ncnc2n(cnc12)[C@@H]1O[C@H](CN(CCI)CCC[C@H](N)C(O)=O)[C@@H](O)[C@H]1O