Reaction Details
TargetProtein arginine N-methyltransferase 1 [11-371]
LigandBDBM50396017
Substrate/Competitorn/a
Meas. Tech.ChEMBL_861218 (CHEMBL2173356)
IC50>100000±n/a nM
Citation Decarlo, DHadden, MK Oncoepigenomics: making histone lysine methylation count. Eur J Med Chem56:179-194 (2012) 
 
Protein arginine N-methyltransferase 1 [11-371]
Name:Protein arginine N-methyltransferase 1 [11-371]
Type:Protein
Mol. Mass.:41506.52
Organism:Homo sapiens (Human)
Description:Q99873[11-371]
Residue:361
BDBM50396017
NameBDBM50396017
Synonyms:CHEMBL2172427
TypeSmall organic molecule
Emp. Form.C18H28IN7O5
Mol. Mass.549.3633
SMILESCNc1ncnc2n(cnc12)[C@@H]1O[C@H](CN(CCI)CCC[C@H](N)C(O)=O)[C@@H](O)[C@H]1O