Reaction Details
TargetLysine-specific demethylase 4E
LigandBDBM50396020
Substrate/Competitorn/a
Meas. Tech.ChEMBL_861177 (CHEMBL2173245)
IC50 180±n/a nM
Citation Decarlo, DHadden, MK Oncoepigenomics: making histone lysine methylation count. Eur J Med Chem56:179-194 (2012) 
 
Lysine-specific demethylase 4E
Name:Lysine-specific demethylase 4E
Type:Enzyme
Mol. Mass.:56815.71
Organism:Homo sapiens (Human)
Description:B2RXH2
Residue:506
BDBM50396020
NameBDBM50396020
Synonyms:CHEMBL1615036
TypeSmall organic molecule
Emp. Form.C14H14N4O3
Mol. Mass.286.286
SMILESNCCNC(=O)c1ccnc(c1)-c1cc(ccn1)C(O)=O