Reaction Details
TargetHistone-lysine N-methyltransferase EHMT1
LigandBDBM50353128
Substrate/Competitorn/a
Meas. Tech.ChEMBL_861224 (CHEMBL2173362)
IC50 19±n/a nM
Citation Decarlo, DHadden, MK Oncoepigenomics: making histone lysine methylation count. Eur J Med Chem56:179-194 (2012) 
 
Histone-lysine N-methyltransferase EHMT1
Name:Histone-lysine N-methyltransferase EHMT1
Type:PROTEIN
Mol. Mass.:141443.67
Organism:Homo sapiens (Human)
Description:ChEMBL_1450367
Residue:1298
BDBM50353128
NameBDBM50353128
Synonyms:CHEMBL1231795
TypeSmall organic molecule
Emp. Form.C30H47N5O2
Mol. Mass.509.7265
SMILESCOc1cc2c(NC3CCN(CC3)C(C)C)nc(nc2cc1OCCCN1CCCC1)C1CCCCC1