Reaction Details
TargetHistone-lysine N-methyltransferase EHMT2
LigandBDBM50396024
Substrate/Competitorn/a
Meas. Tech.ChEMBL_861227 (CHEMBL2173365)
IC50 1300±n/a nM
Citation Decarlo, DHadden, MK Oncoepigenomics: making histone lysine methylation count. Eur J Med Chem56:179-194 (2012) 
 
Histone-lysine N-methyltransferase EHMT2
Name:Histone-lysine N-methyltransferase EHMT2
Type:Enzyme
Mol. Mass.:132339.87
Organism:Homo sapiens (Human)
Description:Q96KQ7
Residue:1210
BDBM50396024
NameBDBM50396024
Synonyms:CHEMBL1232453
TypeSmall organic molecule
Emp. Form.C29H52N8O2
Mol. Mass.544.7756
SMILESCOc1cc2c(NC3CCN(CCCCCN)CC3)nc(NCCCN(C)C)nc2cc1OCCCCCN