Reaction Details
TargetHistone-lysine N-methyltransferase EHMT2
LigandBDBM50396025
Substrate/Competitorn/a
Meas. Tech.ChEMBL_861233 (CHEMBL2173371)
IC50>10000±n/a nM
Citation Decarlo, DHadden, MK Oncoepigenomics: making histone lysine methylation count. Eur J Med Chem56:179-194 (2012) 
 
Histone-lysine N-methyltransferase EHMT2
Name:Histone-lysine N-methyltransferase EHMT2
Type:Enzyme
Mol. Mass.:132339.87
Organism:Homo sapiens (Human)
Description:Q96KQ7
Residue:1210
BDBM50396025
NameBDBM50396025
Synonyms:CHEMBL1089088
TypeSmall organic molecule
Emp. Form.C17H22N2O5S2
Mol. Mass.398.497
SMILESCS[C@@]12CC3=CC=C[C@H](OC(C)=O)[C@H]3N1C(=O)[C@@](CO)(SC)N(C)C2=O