Reaction Details
TargetHistone-lysine N-methyltransferase EHMT2
LigandBDBM50396026
Substrate/Competitorn/a
Meas. Tech.ChEMBL_861233 (CHEMBL2173371)
IC50 630±n/a nM
Citation Decarlo, DHadden, MK Oncoepigenomics: making histone lysine methylation count. Eur J Med Chem56:179-194 (2012) 
 
Histone-lysine N-methyltransferase EHMT2
Name:Histone-lysine N-methyltransferase EHMT2
Type:Enzyme
Mol. Mass.:132339.87
Organism:Homo sapiens (Human)
Description:Q96KQ7
Residue:1210
BDBM50396026
NameBDBM50396026
Synonyms:CHEMBL2172426
TypeSmall organic molecule
Emp. Form.C30H28N6O4S4
Mol. Mass.664.841
SMILESCN1C(=O)[C@@]23C[C@]4([C@H](Nc5ccccc45)N2C(=O)[C@]1(C)SS3)[C@]12C[C@]34SS[C@](C)(N(C)C3=O)C(=O)N4[C@H]1Nc1ccccc21