Reaction Details
TargetHistone-lysine N-methyltransferase SUV39H1
LigandBDBM50134315
Substrate/Competitorn/a
Meas. Tech.ChEMBL_861232 (CHEMBL2173370)
IC50 260±n/a nM
Citation Decarlo, DHadden, MK Oncoepigenomics: making histone lysine methylation count. Eur J Med Chem56:179-194 (2012) 
 
Histone-lysine N-methyltransferase SUV39H1
Name:Histone-lysine N-methyltransferase SUV39H1
Type:PROTEIN
Mol. Mass.:47917.07
Organism:Homo sapiens (Human)
Description:ChEMBL_1473655
Residue:412
BDBM50134315
NameBDBM50134315
Synonyms:7-hydroxy-11-hydroxymethyl-12-methyl-14,15-dithia-9,12-diazatetracyclo[9.2.2.01,9.03,8]pentadeca-3,5-diene-10,13-dione GLIOTOXIN
TypeSmall organic molecule
Emp. Form.C13H14N2O4S2
Mol. Mass.326.391
SMILESCN1C(=O)[C@]23CC4=CC=C[C@H](O)[C@H]4N2C(=O)[C@@]1(CO)SS3