Reaction Details
TargetHistone-lysine N-methyltransferase E(z)
LigandBDBM50315537
Substrate/Competitorn/a
Meas. Tech.ChEMBL_861239 (CHEMBL2173377)
IC50>90000±n/a nM
Citation Decarlo, DHadden, MK Oncoepigenomics: making histone lysine methylation count. Eur J Med Chem56:179-194 (2012) 
 
Histone-lysine N-methyltransferase E(z)
Name:Histone-lysine N-methyltransferase E(z)
Type:PROTEIN
Mol. Mass.:86931.57
Organism:Drosophila melanogaster
Description:ChEMBL_861239
Residue:760
BDBM50315537
NameBDBM50315537
Synonyms:CHEMBL1089316 | chaetocin
TypeSmall organic molecule
Emp. Form.C30H28N6O6S4
Mol. Mass.696.84
SMILESCN1C(=O)[C@@]23C[C@]4([C@H](Nc5ccccc45)N2C(=O)[C@]1(CO)SS3)[C@]12C[C@]34SS[C@](CO)(N(C)C3=O)C(=O)N4[C@H]1Nc1ccccc21