Reaction Details
TargetHistone-lysine N-methyltransferase Su(var)3-9
LigandBDBM50315537
Substrate/Competitorn/a
Meas. Tech.ChEMBL_861241 (CHEMBL2173379)
IC50 600±n/a nM
Citation Decarlo, DHadden, MK Oncoepigenomics: making histone lysine methylation count. Eur J Med Chem56:179-194 (2012) 
 
Histone-lysine N-methyltransferase Su(var)3-9
Name:Histone-lysine N-methyltransferase Su(var)3-9
Type:PROTEIN
Mol. Mass.:71919.98
Organism:Drosophila melanogaster
Description:ChEMBL_1294298
Residue:635
BDBM50315537
NameBDBM50315537
Synonyms:CHEMBL1089316 | chaetocin
TypeSmall organic molecule
Emp. Form.C30H28N6O6S4
Mol. Mass.696.84
SMILESCN1C(=O)[C@@]23C[C@]4([C@H](Nc5ccccc45)N2C(=O)[C@]1(CO)SS3)[C@]12C[C@]34SS[C@](CO)(N(C)C3=O)C(=O)N4[C@H]1Nc1ccccc21