Reaction Details
TargetHistone deacetylase 6
LigandBDBM50238632
Substrate/Competitorn/a
Meas. Tech.ChEMBL_861418 (CHEMBL2174032)
IC50>10000±n/a nM
Citation Olsen, CAMontero, ALeman, LJGhadiri, MR Macrocyclic peptoid-Peptide hybrids as inhibitors of class I histone deacetylases. ACS Med Chem Lett3:749-753 (2012) 
 
Histone deacetylase 6
Name:Histone deacetylase 6
Type:Chromatin regulator; hydrolase; repressor
Mol. Mass.:131381.51
Organism:Homo sapiens (Human)
Description:Q9UBN7
Residue:1215
BDBM50238632
NameBDBM50238632
Synonyms:(6S,9S,12S,14aR)-6-((S)-sec-Butyl)-9-(1-methoxy-1H-indol-3-ylmethyl)-12-(6-oxo-octyl)-decahydro-4a,7,10,13-tetraaza-benzocyclododecene-5,8,11,14-tetraone ChEMBL_275631
TypeSmall organic molecule
Emp. Form.C34H49N5O6
Mol. Mass.623.7828
SMILESCC[C@H](C)[C@@H]1NC(=O)[C@H](Cc2cn(OC)c3ccccc23)NC(=O)[C@H](CCCCCC(=O)CC)NC(=O)[C@H]2CCCCN2C1=O