Reaction Details
TargetNAD-dependent protein deacetylase sirtuin-1
LigandBDBM50000029
Substrate/Competitorn/a
Meas. Tech.ChEMBL_861568 (CHEMBL2174509)
IC50 300±n/a nM
Citation Blum, CAEllis, JLLoh, CNg, PYPerni, RBStein, RL SIRT1 modulation as a novel approach to the treatment of diseases of aging. J Med Chem54:417-32 (2011) 
 
NAD-dependent protein deacetylase sirtuin-1
Name:NAD-dependent protein deacetylase sirtuin-1
Type:Developmental protein; hydrolase
Mol. Mass.:81626.66
Organism:Homo sapiens (Human)
Description:n/a
Residue:747
BDBM50000029
NameBDBM50000029
Synonyms:4-Methyl-8-{4-methyl-3-[3-(3-{3-[2-methyl-5-(4,6,8-trisulfo-naphthalen-1-ylcarbamoyl)-phenylcarbamoyl]-phenyl}-ureido)-benzoylamino]-benzoylamino}-naphthalene-1,3,5-trisulfonic acid; hexa-kis Sodium salt CHEMBL265502 Suramin sodium suramin Na
TypeSmall organic molecule
Emp. Form.C51H34N6O23S6
Mol. Mass.1291.235
SMILESCc1ccc(cc1NC(=O)c1cccc(NC(=O)Nc2cccc(c2)C(=O)Nc2cc(ccc2C)C(=O)Nc2ccc(c3cc(cc(c23)S([O-])(=O)=O)S([O-])(=O)=O)S([O-])(=O)=O)c1)C(=O)Nc1ccc(c2cc(cc(c12)S([O-])(=O)=O)S([O-])(=O)=O)S([O-])(=O)=O