Reaction Details
TargetNon-lysosomal glucosylceramidase
LigandBDBM18351
Substrate/Competitorn/a
Meas. Tech.ChEMBL_861595 (CHEMBL2174536)
IC50 30000±n/a nM
Citation Liu, JObando, DLiao, VLifa, TCodd, R The many faces of the adamantyl group in drug design. Eur J Med Chem46:1949-63 (2011) 
 
Non-lysosomal glucosylceramidase
Name:Non-lysosomal glucosylceramidase
Type:PROTEIN
Mol. Mass.:104639.04
Organism:Homo sapiens (Human)
Description:ChEMBL_1435476
Residue:927
BDBM18351
NameBDBM18351
Synonyms:(2R,3R,4R,5S)-2-(Hydroxymethyl)piperidine-3,4,5-triol, 10 1-Deoxynojirimycin CHEMBL307429 US9181184, 1 | dNM
Typenatural product
Emp. Form.C6H13NO4
Mol. Mass.163.1717
SMILESOC[C@H]1NC[C@H](O)[C@@H](O)[C@@H]1O