Reaction Details
TargetPolyunsaturated fatty acid 5-lipoxygenase
LigandBDBM50273682
Substrate/Competitorn/a
Meas. Tech.ChEMBL_861606 (CHEMBL2174547)
IC50 7600±n/a nM
Citation Hieke, MGreiner, CDittrich, MReisen, FSchneider, GSchubert-Zsilavecz, MWerz, O Discovery and biological evaluation of a novel class of dual microsomal prostaglandin E2 synthase-1/5-lipoxygenase inhibitors based on 2-[(4,6-diphenethoxypyrimidin-2-yl)thio]hexanoic acid. J Med Chem54:4490-507 (2011) 
 
Polyunsaturated fatty acid 5-lipoxygenase
Name:Polyunsaturated fatty acid 5-lipoxygenase
Type:Enzyme
Mol. Mass.:77972.74
Organism:Homo sapiens (Human)
Description:Recombinant protein was purified from E. coli lysate. After ammonium sulfate precipitation and subsequent steps, the supernatant (S100) was used for 5-LO activity assay.
Residue:674
BDBM50273682
NameBDBM50273682
Synonyms:2-(4,6-Diphenethoxypyrimidin-2-ylthio)acetic acid | CHEMBL518507
TypeSmall organic molecule
Emp. Form.C22H22N2O4S
Mol. Mass.410.486
SMILESOC(=O)CSc1nc(OCCc2ccccc2)cc(OCCc2ccccc2)n1