Reaction Details
TargetTyrosine-protein kinase SYK
LigandBDBM50249090
Substrate/Competitorn/a
Meas. Tech.ChEMBL_861799 (CHEMBL2173392)
EC50 115±n/a nM
Citation Singh, RMasuda, ESPayan, DG Discovery and development of spleen tyrosine kinase (SYK) inhibitors. J Med Chem55:3614-43 (2012) 
 
Tyrosine-protein kinase SYK
Name:Tyrosine-protein kinase SYK
Type:Enzyme
Mol. Mass.:72079.99
Organism:Homo sapiens (Human)
Description:P43405
Residue:635
BDBM50249090
NameBDBM50249090
Synonyms:3,3'-(5-fluoropyrimidine-2,4-diyl)bis(azanediyl)diphenol | CHEMBL515271
TypeSmall organic molecule
Emp. Form.C16H13FN4O2
Mol. Mass.312.2984
SMILESOc1cccc(Nc2ncc(F)c(Nc3cccc(O)c3)n2)c1