Reaction Details
TargetTyrosine-protein kinase SYK
LigandBDBM50396073
Substrate/Competitorn/a
Meas. Tech.ChEMBL_861803 (CHEMBL2173396)
EC50 2500±n/a nM
Citation Singh, RMasuda, ESPayan, DG Discovery and development of spleen tyrosine kinase (SYK) inhibitors. J Med Chem55:3614-43 (2012) 
 
Tyrosine-protein kinase SYK
Name:Tyrosine-protein kinase SYK
Type:Enzyme
Mol. Mass.:72079.99
Organism:Homo sapiens (Human)
Description:P43405
Residue:635
BDBM50396073
NameBDBM50396073
Synonyms:CHEMBL1235110
TypeSmall organic molecule
Emp. Form.C18H24N6O
Mol. Mass.340.4228
SMILESCc1cccc(Nc2nc(N[C@@H]3CCCC[C@@H]3N)ncc2C(N)=O)c1