Reaction Details
TargetTyrosine-protein kinase SYK
LigandBDBM50396074
Substrate/Competitorn/a
Meas. Tech.ChEMBL_861804 (CHEMBL2173397)
EC50 1080±n/a nM
Citation Singh, RMasuda, ESPayan, DG Discovery and development of spleen tyrosine kinase (SYK) inhibitors. J Med Chem55:3614-43 (2012) 
 
Tyrosine-protein kinase SYK
Name:Tyrosine-protein kinase SYK
Type:Enzyme
Mol. Mass.:72079.99
Organism:Homo sapiens (Human)
Description:P43405
Residue:635
BDBM50396074
NameBDBM50396074
Synonyms:CHEMBL2170585
TypeSmall organic molecule
Emp. Form.C21H18N6O2
Mol. Mass.386.4066
SMILESCOc1ccc(cc1OC)-c1cc2nccn2c(Nc2ccc3cn[nH]c3c2)n1