Reaction Details
TargetTyrosine-protein kinase SYK
LigandBDBM50396076
Substrate/Competitorn/a
Meas. Tech.ChEMBL_861812 (CHEMBL2173405)
IC50 10000±n/a nM
Citation Singh, RMasuda, ESPayan, DG Discovery and development of spleen tyrosine kinase (SYK) inhibitors. J Med Chem55:3614-43 (2012) 
 
Tyrosine-protein kinase SYK
Name:Tyrosine-protein kinase SYK
Type:PROTEIN
Mol. Mass.:71541.93
Organism:Rattus norvegicus
Description:ChEMBL_1348392
Residue:629
BDBM50396076
NameBDBM50396076
Synonyms:CHEMBL2170739
TypeSmall organic molecule
Emp. Form.C18H20N2O
Mol. Mass.280.3642
SMILESCc1ccc2c(c1C)n(CCCN)c1ccccc1c2=O