Reaction Details
TargetTyrosine-protein kinase SYK
LigandBDBM50126400
Substrate/Competitorn/a
Meas. Tech.ChEMBL_861815 (CHEMBL2173408)
IC50 90±n/a nM
Citation Singh, RMasuda, ESPayan, DG Discovery and development of spleen tyrosine kinase (SYK) inhibitors. J Med Chem55:3614-43 (2012) 
 
Tyrosine-protein kinase SYK
Name:Tyrosine-protein kinase SYK
Type:Enzyme
Mol. Mass.:72079.99
Organism:Homo sapiens (Human)
Description:P43405
Residue:635
BDBM50126400
NameBDBM50126400
Synonyms:CHEMBL30873 N1-(7-(4-isopropylphenyl)-1,6-naphthyridin-5-yl)propane-1,3-diamine
TypeSmall organic molecule
Emp. Form.C20H24N4
Mol. Mass.320.4314
SMILESCC(C)c1ccc(cc1)-c1cc2ncccc2c(NCCCN)n1