Reaction Details
TargetTyrosine-protein kinase SYK
LigandBDBM50126403
Substrate/Competitorn/a
Meas. Tech.ChEMBL_861815 (CHEMBL2173408)
IC50 420±n/a nM
Citation Singh, RMasuda, ESPayan, DG Discovery and development of spleen tyrosine kinase (SYK) inhibitors. J Med Chem55:3614-43 (2012) 
 
Tyrosine-protein kinase SYK
Name:Tyrosine-protein kinase SYK
Type:Enzyme
Mol. Mass.:72079.99
Organism:Homo sapiens (Human)
Description:P43405
Residue:635
BDBM50126403
NameBDBM50126403
Synonyms:CHEMBL33009 | N*1*-(7-{4-[(3-Dimethylamino-propyl)-methyl-amino]-phenyl}-[1,6]naphthyridin-5-yl)-propane-1,3-diamine
TypeSmall organic molecule
Emp. Form.C23H32N6
Mol. Mass.392.5404
SMILESCN(C)CCCN(C)c1ccc(cc1)-c1cc2ncccc2c(NCCCN)n1