Reaction Details
TargetTyrosine-protein kinase SYK
LigandBDBM50126413
Substrate/Competitorn/a
Meas. Tech.ChEMBL_861815 (CHEMBL2173408)
IC50 8±n/a nM
Citation Singh, RMasuda, ESPayan, DG Discovery and development of spleen tyrosine kinase (SYK) inhibitors. J Med Chem55:3614-43 (2012) 
 
Tyrosine-protein kinase SYK
Name:Tyrosine-protein kinase SYK
Type:Enzyme
Mol. Mass.:72079.99
Organism:Homo sapiens (Human)
Description:P43405
Residue:635
BDBM50126413
NameBDBM50126413
Synonyms:CHEMBL287478 | N*1*-[7-(4-Morpholin-4-yl-phenyl)-[1,6]naphthyridin-5-yl]-propane-1,3-diamine
TypeSmall organic molecule
Emp. Form.C21H25N5O
Mol. Mass.363.4561
SMILESNCCCNc1nc(cc2ncccc12)-c1ccc(cc1)N1CCOCC1