Reaction Details
TargetTyrosine-protein kinase SYK
LigandBDBM50126446
Substrate/Competitorn/a
Meas. Tech.ChEMBL_861815 (CHEMBL2173408)
IC50 1500±n/a nM
Citation Singh, RMasuda, ESPayan, DG Discovery and development of spleen tyrosine kinase (SYK) inhibitors. J Med Chem55:3614-43 (2012) 
 
Tyrosine-protein kinase SYK
Name:Tyrosine-protein kinase SYK
Type:Enzyme
Mol. Mass.:72079.99
Organism:Homo sapiens (Human)
Description:P43405
Residue:635
BDBM50126446
NameBDBM50126446
Synonyms:CHEMBL31668 | N*1*-[7-(4-Methoxy-phenyl)-[1,6]naphthyridin-5-yl]-ethane-1,2-diamine
TypeSmall organic molecule
Emp. Form.C17H18N4O
Mol. Mass.294.351
SMILESCOc1ccc(cc1)-c1cc2ncccc2c(NCCN)n1