Reaction Details
TargetTyrosine-protein kinase SYK
LigandBDBM50132443
Substrate/Competitorn/a
Meas. Tech.ChEMBL_861815 (CHEMBL2173408)
IC50 12±n/a nM
Citation Singh, RMasuda, ESPayan, DG Discovery and development of spleen tyrosine kinase (SYK) inhibitors. J Med Chem55:3614-43 (2012) 
 
Tyrosine-protein kinase SYK
Name:Tyrosine-protein kinase SYK
Type:Enzyme
Mol. Mass.:72079.99
Organism:Homo sapiens (Human)
Description:P43405
Residue:635
BDBM50132443
NameBDBM50132443
Synonyms:4-{5-Methoxy-3-[2-oxo-5-sulfamoyl-1,2-dihydro-indol-(3Z)-ylidenemethyl]-indol-1-yl}-butyramide | CHEMBL431645
TypeSmall organic molecule
Emp. Form.C22H22N4O5S
Mol. Mass.454.499
SMILESCOc1ccc2n(CCCC(N)=O)cc(\C=C3/C(=O)Nc4ccc(cc34)S(N)(=O)=O)c2c1