Reaction Details
TargetProstate-specific antigen
LigandBDBM50298759
Substrate/Competitorn/a
Meas. Tech.ChEMBL_862795 (CHEMBL2172815)
Ki 65±n/a nM
Citation Caliendo, GSantagada, VPerissutti, ESeverino, BFiorino, FFrecentese, FJuliano, L Kallikrein protease activated receptor (PAR) axis: an attractive target for drug development. J Med Chem55:6669-86 (2012) 
 
Prostate-specific antigen
Name:Prostate-specific antigen
Type:PROTEIN
Mol. Mass.:28747.53
Organism:Homo sapiens (Human)
Description:ChEMBL_959198
Residue:261
BDBM50298759
NameBDBM50298759
Synonyms:(5S,8S,11S,14S,17R)-11-(4-aminobutyl)-5,8-bis(hydroxymethyl)-14-isobutyl-19-methyl-3,6,9,12,15-pentaoxo-1-phenyl-2-oxa-4,7,10,13,16-pentaazaicosan-17-ylboronic acid | CHEMBL582947
TypeSmall organic molecule
Emp. Form.C31H53BN6O10
Mol. Mass.680.598
SMILESCC(C)C[C@H](NC(=O)[C@H](CC(C)C)NC(=O)[C@H](CCCCN)NC(=O)[C@H](CO)NC(=O)[C@H](CO)NC(=O)OCc1ccccc1)B(O)O