Reaction Details
TargetKallikrein-1
LigandBDBM50396165
Substrate/Competitorn/a
Meas. Tech.ChEMBL_862798 (CHEMBL2172818)
Ki 110±n/a nM
Citation Caliendo, GSantagada, VPerissutti, ESeverino, BFiorino, FFrecentese, FJuliano, L Kallikrein protease activated receptor (PAR) axis: an attractive target for drug development. J Med Chem55:6669-86 (2012) 
 
Kallikrein-1
Name:Kallikrein-1
Type:Enzyme
Mol. Mass.:28874.69
Organism:Homo sapiens (Human)
Description:P06870
Residue:262
BDBM50396165
NameBDBM50396165
Synonyms:CHEMBL2171750
TypeSmall organic molecule
Emp. Form.C26H42N8O5
Mol. Mass.546.6623
SMILESNC1CCC(C[C@H](NC(=O)Cc2ccccc2)C(=O)N[C@@H](CO)C(=O)N[C@@H](CCCN=C(N)N)C(N)=O)CC1