Reaction Details
Target2-Hydroxyacid oxidase 2
LigandBDBM50396220
Substrate/Competitorn/a
Meas. Tech.ChEMBL_863190 (CHEMBL2175914)
IC50 900±n/a nM
Citation Barawkar, DABandyopadhyay, ADeshpande, AKoul, SKandalkar, SPatil, PKhose, GVyas, SMone, MBhosale, SSingh, UDe, SMeru, AGundu, JChugh, APalle, VPMookhtiar, KAVacca, JPChakravarty, PKNargund, RPWright, SDRoy, SGraziano, MPCully, DCai, TQSingh, SB Discovery of pyrazole carboxylic acids as potent inhibitors of rat long chain L-2-hydroxy acid oxidase. Bioorg Med Chem Lett22:4341-7 (2012) 
 
2-Hydroxyacid oxidase 2
Name:2-Hydroxyacid oxidase 2
Type:PROTEIN
Mol. Mass.:39204.34
Organism:Rattus norvegicus
Description:ChEMBL_863190
Residue:353
BDBM50396220
NameBDBM50396220
Synonyms:CHEMBL2172181
TypeSmall organic molecule
Emp. Form.C19H17FN2O2
Mol. Mass.324.3489
SMILESCc1[nH]nc(C(O)=O)c1CCc1cccc(c1)-c1ccc(F)cc1