Reaction Details
Target5-hydroxytryptamine receptor 6
LigandBDBM103505
Substrate/Competitorn/a
Meas. Tech.ChEMBL_863380 (CHEMBL2176580)
Ki 0.66±n/a nM
Citation Ivachtchenko, AVGolovina, ESKadieva, MGKysil, VMMitkin, ODVorobiev, AAOkun, I Antagonists of 5-HT6 receptors. Substituted 3-(phenylsulfonyl)pyrazolo[1,5-a]pyrido[3,4-e]pyrimidines and 3-(phenylsulfonyl)pyrazolo[1,5-a]pyrido[4,3-d]pyrimidines-Synthesis and 'structure-activity' relationship. Bioorg Med Chem Lett22:4273-80 (2012) 
 
5-hydroxytryptamine receptor 6
Name:5-hydroxytryptamine receptor 6
Type:G Protein-Coupled Receptor (GPCR)
Mol. Mass.:46968.43
Organism:Homo sapiens (Human)
Description:P50406
Residue:440
BDBM103505
NameBDBM103505
Synonyms:CHEMBL2172193 | US8552017, 2(4).HCl
TypeSmall organic molecule
Emp. Form.C18H21N5O2S
Mol. Mass.371.457
SMILESCNc1nn2c(C)c3CN(C)CCc3nc2c1S(=O)(=O)c1ccccc1