Reaction Details
TargetALK tyrosine kinase receptor
LigandBDBM50396250
Substrate/Competitorn/a
Meas. Tech.ChEMBL_863883 (CHEMBL2176367)
IC50 5±n/a nM
Citation Lewis, RTBode, CMChoquette, DMPotashman, MRomero, KStellwagen, JCTeffera, YMoore, EWhittington, DAChen, HEpstein, LFEmkey, RAndrews, PSYu, VLSaffran, DCXu, MDrew, AMerkel, PSzilvassy, SBrake, RL The discovery and optimization of a novel class of potent, selective, and orally bioavailable anaplastic lymphoma kinase (ALK) inhibitors with potential utility for the treatment of cancer. J Med Chem55:6523-40 (2012) 
 
ALK tyrosine kinase receptor
Name:ALK tyrosine kinase receptor
Type:Protein
Mol. Mass.:176453.10
Organism:Homo sapiens (Human)
Description:Q9UM73
Residue:1620
BDBM50396250
NameBDBM50396250
Synonyms:CHEMBL2172333
TypeSmall organic molecule
Emp. Form.C29H37FN6O2
Mol. Mass.520.6415
SMILESCC(C)NC(=O)[C@H]1CC[C@H](CC1)n1c(NC(=O)c2ccc(F)cc2)nc2ccc(CN3CCNCC3)cc12