Reaction Details
TargetALK tyrosine kinase receptor
LigandBDBM50396252
Substrate/Competitorn/a
Meas. Tech.ChEMBL_863887 (CHEMBL2176371)
IC50 2±n/a nM
Citation Lewis, RTBode, CMChoquette, DMPotashman, MRomero, KStellwagen, JCTeffera, YMoore, EWhittington, DAChen, HEpstein, LFEmkey, RAndrews, PSYu, VLSaffran, DCXu, MDrew, AMerkel, PSzilvassy, SBrake, RL The discovery and optimization of a novel class of potent, selective, and orally bioavailable anaplastic lymphoma kinase (ALK) inhibitors with potential utility for the treatment of cancer. J Med Chem55:6523-40 (2012) 
 
ALK tyrosine kinase receptor
Name:ALK tyrosine kinase receptor
Type:Protein
Mol. Mass.:176453.10
Organism:Homo sapiens (Human)
Description:Q9UM73
Residue:1620
BDBM50396252
NameBDBM50396252
Synonyms:CHEMBL2172332
TypeSmall organic molecule
Emp. Form.C27H30FN7O2
Mol. Mass.503.5712
SMILESCC(C)NC(=O)[C@H]1CC[C@H](CC1)n1c(NC(=O)c2ccc(F)cc2)nc2ccc(Cn3cncn3)cc12