Reaction Details
TargetTyrosine-protein kinase Mer
LigandBDBM50396243
Substrate/Competitorn/a
Meas. Tech.ChEMBL_863857 (CHEMBL2176247)
Kd 18±n/a nM
Citation Lewis, RTBode, CMChoquette, DMPotashman, MRomero, KStellwagen, JCTeffera, YMoore, EWhittington, DAChen, HEpstein, LFEmkey, RAndrews, PSYu, VLSaffran, DCXu, MDrew, AMerkel, PSzilvassy, SBrake, RL The discovery and optimization of a novel class of potent, selective, and orally bioavailable anaplastic lymphoma kinase (ALK) inhibitors with potential utility for the treatment of cancer. J Med Chem55:6523-40 (2012) 
 
Tyrosine-protein kinase Mer
Name:Tyrosine-protein kinase Mer
Type:PROTEIN
Mol. Mass.:110234.77
Organism:Homo sapiens (Human)
Description:ChEMBL_1498723
Residue:999
BDBM50396243
NameBDBM50396243
Synonyms:CHEMBL2172308 | US10370379, Compound TSR-011
TypeSmall organic molecule
Emp. Form.C33H44FN5O3
Mol. Mass.577.7326
SMILESCC(C)NC(=O)[C@H]1CC[C@H](CC1)n1c(NC(=O)c2ccc(F)cc2)nc2ccc(CN3CCC(CC3)C(C)(C)O)cc12