Reaction Details
TargetALK tyrosine kinase receptor
LigandBDBM50396245
Substrate/Competitorn/a
Meas. Tech.ChEMBL_863887 (CHEMBL2176371)
IC50 1.4±n/a nM
Citation Lewis, RTBode, CMChoquette, DMPotashman, MRomero, KStellwagen, JCTeffera, YMoore, EWhittington, DAChen, HEpstein, LFEmkey, RAndrews, PSYu, VLSaffran, DCXu, MDrew, AMerkel, PSzilvassy, SBrake, RL The discovery and optimization of a novel class of potent, selective, and orally bioavailable anaplastic lymphoma kinase (ALK) inhibitors with potential utility for the treatment of cancer. J Med Chem55:6523-40 (2012) 
 
ALK tyrosine kinase receptor
Name:ALK tyrosine kinase receptor
Type:Protein
Mol. Mass.:176453.10
Organism:Homo sapiens (Human)
Description:Q9UM73
Residue:1620
BDBM50396245
NameBDBM50396245
Synonyms:CHEMBL2172306
TypeSmall organic molecule
Emp. Form.C31H39FN6O3
Mol. Mass.562.6782
SMILESCC(C)NC(=O)[C@H]1CC[C@H](CC1)n1c(NC(=O)c2ccc(F)cc2)nc2ccc(CN3CCC(CC3)C(N)=O)cc12