Reaction Details
TargetSerine/threonine-protein kinase mTOR
LigandBDBM50396303
Substrate/Competitorn/a
Meas. Tech.ChEMBL_864284 (CHEMBL2175555)
IC50 4±n/a nM
Citation Peterson, EABoezio, AAAndrews, PSBoezio, CMBush, TLCheng, ACChoquette, DCoats, JRColletti, AECopeland, KWDuPont, MGraceffa, RGrubinska, BKim, JLLewis, RTLiu, JMullady, ELPotashman, MHRomero, KShaffer, PLStanton, MKStellwagen, JCTeffera, YYi, SCai, TLa, DS Discovery and optimization of potent and selective imidazopyridine and imidazopyridazine mTOR inhibitors. Bioorg Med Chem Lett22:4967-74 (2012) 
 
Serine/threonine-protein kinase mTOR
Name:Serine/threonine-protein kinase mTOR
Type:Rapamycin target protein
Mol. Mass.:288917.12
Organism:Homo sapiens (Human)
Description:P42345
Residue:2549
BDBM50396303
NameBDBM50396303
Synonyms:CHEMBL2172484
TypeSmall organic molecule
Emp. Form.C20H18N10
Mol. Mass.398.4239
SMILESCc1cc(ccn1)-c1ccc2nc(Nc3ccn[nH]3)c(-c3nc(C)nc(N)n3)n2c1