Reaction Details
TargetSerine/threonine-protein kinase mTOR
LigandBDBM50396308
Substrate/Competitorn/a
Meas. Tech.ChEMBL_864284 (CHEMBL2175555)
IC50 3±n/a nM
Citation Peterson, EABoezio, AAAndrews, PSBoezio, CMBush, TLCheng, ACChoquette, DCoats, JRColletti, AECopeland, KWDuPont, MGraceffa, RGrubinska, BKim, JLLewis, RTLiu, JMullady, ELPotashman, MHRomero, KShaffer, PLStanton, MKStellwagen, JCTeffera, YYi, SCai, TLa, DS Discovery and optimization of potent and selective imidazopyridine and imidazopyridazine mTOR inhibitors. Bioorg Med Chem Lett22:4967-74 (2012) 
 
Serine/threonine-protein kinase mTOR
Name:Serine/threonine-protein kinase mTOR
Type:Rapamycin target protein
Mol. Mass.:288917.12
Organism:Homo sapiens (Human)
Description:P42345
Residue:2549
BDBM50396308
NameBDBM50396308
Synonyms:CHEMBL2172636
TypeSmall organic molecule
Emp. Form.C19H16N10
Mol. Mass.384.3973
SMILESCc1nc(N)nc(n1)-c1c(Nc2ccn[nH]2)nc2ccc(cn12)-c1cccnc1