Reaction Details
TargetChloroquine resistance transporter
LigandBDBM50396334
Substrate/Competitorn/a
Meas. Tech.ChEMBL_864478 (CHEMBL2176281)
IC50 10300±n/a nM
Citation Gemma, SCamodeca, CSanna Coccone, SJoshi, BPBernetti, MMoretti, VBrogi, SBonache de Marcos, MCSavini, LTaramelli, DBasilico, NParapini, SRottmann, MBrun, RLamponi, SCaccia, SGuiso, GSummers, RLMartin, RESaponara, SGorelli, BNovellino, ECampiani, GButini, S Optimization of 4-aminoquinoline/clotrimazole-based hybrid antimalarials: further structure-activity relationships, in vivo studies, and preliminary toxicity profiling. J Med Chem55:6948-67 (2012) 
 
Chloroquine resistance transporter
Name:Chloroquine resistance transporter
Type:PROTEIN
Mol. Mass.:48687.29
Organism:Plasmodium falciparum
Description:ChEMBL_1364181
Residue:424
BDBM50396334
NameBDBM50396334
Synonyms:CHEMBL2170034
TypeSmall organic molecule
Emp. Form.C27H26Cl2N4
Mol. Mass.477.428
SMILESClc1ccc(cc1)C(Nc1ccnc2cc(Cl)ccc12)c1ccc(CN2CCNCC2)cc1