Reaction Details
TargetSodium/hydrogen exchanger 1
LigandBDBM50396463
Substrate/Competitorn/a
Meas. Tech.ChEMBL_862405 (CHEMBL2173435)
IC50 5±n/a nM
Citation Huber, JDBentzien, JBoyer, SJBurke, JDe Lombaert, SEickmeier, CGuo, XHaist, JVHickey, ERKaplita, PKarmazyn, MKemper, RKennedy, CAKirrane, TMadwed, JBMainolfi, ENagaraja, NSoleymanzadeh, FSwinamer, AEldrup, AB Identification of a potent sodium hydrogen exchanger isoform 1 (NHE1) inhibitor with a suitable profile for chronic dosing and demonstrated cardioprotective effects in a preclinical model of myocardial infarction in the rat. J Med Chem55:7114-40 (2012) 
 
Sodium/hydrogen exchanger 1
Name:Sodium/hydrogen exchanger 1
Type:PROTEIN
Mol. Mass.:90771.96
Organism:Homo sapiens (Human)
Description:ChEMBL_862405
Residue:815
BDBM50396463
NameBDBM50396463
Synonyms:CHEMBL2170611
TypeSmall organic molecule
Emp. Form.C17H21F3N4O2
Mol. Mass.370.3694
SMILESCC(=O)N1CCC(CC1)c1cc(C)c(cc1C(F)(F)F)C(=O)NC(N)=N