Reaction Details
TargetGlucose-6-phosphate dehydrogenase
LigandBDBM50396488
Substrate/Competitorn/a
Meas. Tech.ChEMBL_862644 (CHEMBL2174117)
IC50 3300±n/a nM
Citation Preuss, JMaloney, PPeddibhotla, SHedrick, MPHershberger, PGosalia, PMilewski, MLi, YLSugarman, EHood, BSuyama, ENguyen, KVasile, SSergienko, EMangravita-Novo, AVicchiarelli, MMcAnally, DSmith, LHRoth, GPDiwan, JChung, TDJortzik, ERahlfs, SBecker, KPinkerton, ABBode, L Discovery of a Plasmodium falciparum glucose-6-phosphate dehydrogenase 6-phosphogluconolactonase inhibitor (R,Z)-N-((1-ethylpyrrolidin-2-yl)methyl)-2-(2-fluorobenzylidene)-3-oxo-3,4-dihydro-2H-benzo[b][1,4]thiazine-6-carboxamide (ML276) that reduces parasite growth in vitro. J Med Chem55:7262-72 (2012) 
 
Glucose-6-phosphate dehydrogenase
Name:Glucose-6-phosphate dehydrogenase
Type:PROTEIN
Mol. Mass.:86360.63
Organism:Plasmodium falciparum
Description:ChEMBL_862647
Residue:736
BDBM50396488
NameBDBM50396488
Synonyms:CHEMBL2170929
TypeSmall organic molecule
Emp. Form.C23H24ClN3O2S
Mol. Mass.441.974
SMILESCCN1CCCC1CNC(=O)c1ccc2S\C(=C/c3ccccc3Cl)C(=O)Nc2c1