Reaction Details
TargetPhosphatidylinositol 4,5-bisphosphate 3-kinase catalytic subunit gamma isoform
LigandBDBM50396610
Substrate/Competitorn/a
Meas. Tech.ChEMBL_864101 (CHEMBL2174949)
Ki 92±n/a nM
Citation Gonzalez-Lopez de Turiso, FShin, YBrown, MCardozo, MChen, YFong, DHao, XHe, XHenne, KHu, YLJohnson, MGKohn, TLohman, JMcBride, HJMcGee, LRMedina, JCMetz, DMiner, KMohn, DPattaropong, VSeganish, JSimard, JLWannberg, SWhittington, DAYu, GCushing, TD Discovery and in vivo evaluation of dual PI3Kß/d inhibitors. J Med Chem55:7667-85 (2012) 
 
Phosphatidylinositol 4,5-bisphosphate 3-kinase catalytic subunit gamma isoform
Name:Phosphatidylinositol 4,5-bisphosphate 3-kinase catalytic subunit gamma isoform
Type:Enzyme Subunit
Mol. Mass.:126470.30
Organism:Homo sapiens (Human)
Description:P48736
Residue:1102
BDBM50396610
NameBDBM50396610
Synonyms:CHEMBL2171929 | US8765940, 4-(3,3-dimethyl-6-(4-morpholinyl)-2,3-dihydro-1H-pyrrolo[3,2-b]pyridin-1-yl)-7-fluoro-3-methyl-2-(2-pyridinyl)quinoline
TypeSmall organic molecule
Emp. Form.C28H28FN5O
Mol. Mass.469.5532
SMILESCc1c(nc2cc(F)ccc2c1N1CC(C)(C)c2ncc(cc12)N1CCOCC1)-c1ccccn1